{"text_format":"1","workbook":"xlsx","n_sheets":3,"sheets":["Option Profit Calculator","Notes","Lists"],"not_rendered":{"charts":1,"images":1,"macros":1,"external_links":0,"defined_names":22,"comments":2,"pivot_tables":0},"unopened":[],"bounds":{"document_bytes":16777216,"sheet_cells":100000,"rows_first":2000,"rows_last":500,"rows_between":2000,"halvings":0,"cell_chars":16384,"cell_head_chars":4096},"cells_cut":0,"cells_raw":0,"read":"whole","date_system":"1900"}

{"sheet":"Option Profit Calculator","index":0,"n_rows":424,"n_cols":40,"rows_kept":424,"cut":false,"hidden":false,"merged":[[18,9,18,10],[1,8,3,12],[1,13,3,27]]}
[]
[null,null,null,null,null,null,null,null,"Option Strategy Template",null,null,null,null,"Important Note: This template works with Options Data/Chains from MarketXLS.com, if you do not have or want MarketXLS, you may need to adjust the formulaes and VBA in this template. This template is completely open and password free. "]
[]
[]
[null,null,null,null,null,null,null,null,null,null,null,null,null,"Want MarketXLS? ",null,"Book a demo here.",null,null,"Look at the prices here"]
[]
[null,null,null,null,null,"Enter symbol here >> ",null,"AAPL"]
[null,null,null,null,null,"Current Price >>",null,290.47000000000003,"* Use =qm_StreamLast for Real Time Streaming Prices, use =Last for Last price"]
[null,null,null,null,null,null,null,null,null,null,"last","ask","bid",null,"contractvolume",null,null,"delta","gamma","theta","rho",null,null,null,null,null,null,null,null,{"$f":"setChartAxis(\"Option Profit Calculator\",\"Chart 9\",\"Min\",\"X\",\"Primary\",MIN($AM$26:$AM$4999))","v":"X Primary Min: 270"}]
[null,null,null,null,"Legs","Expiry Date","Strike","Direction","Position","Instrument","Last","Ask","Bid","Limit Order Price","Spread","Volume","Units*","Investment","Sign","Deal price","Initial CF","Final CF","Profit/Loss",null,null,null,null,null,null,{"$f":"setChartAxis(\"Option Profit Calculator\",\"Chart 9\",\"Min\",\"Value\",\"Y\",MIN($AM$26:$AM$5000))","v":"Value Y Min: 270"}]
[null,"Pre-defined Strategies",null,null,null,null,null,null,"Buy","Stock",{"$f":"H8","v":290.47000000000003},{"$f":"_xll.Ask(symbol)","v":310.91000000000003},{"$f":"_xll.Bid(symbol)","v":310.89},null,{"$f":"IFERROR(L11-M11,\"\")","v":2.0000000000038654E-2},{"$f":"_xll.Volume(symbol)","v":4965699},1,{"$f":"IF(I11<>\"\",Q11*T11*S11,0)","v":310.89},{"$f":"IF(I11=Lists!$N$2,1,IF(I11=Lists!$N$3,-1,0))","v":1},{"$f":"IF(N11=\"\",IF(I11=Lists!$N$2,M11,IF(I11=Lists!$N$3,L11,K11)),N11)","v":310.89},{"$f":"R11","v":310.89},{"$f":"IF(I11<>\"\",IF(H11=Lists!$C$1,MAX(0,ExpiryPrice-G11),IF(H11=Lists!$C$2,MAX(0,G11-ExpiryPrice),ExpiryPrice)),0)*Q11*S11","v":300},{"$f":"V11-U11","v":-10.889999999999986},null,null,null,null,null,null,{"$f":"setChartAxis(\"Option Profit Calculator\",\"Chart 9\",\"Max\",\"X\",\"Primary\",MAX($AM$26:$AM$4999))","v":"X Primary Max: 327.5"}]
[null,"Type","Bullish",null,1,"2020-01-24",280,"Call","Buy",{"$f":"\"@\"&LEFT(symbol&\"      \",6)&RIGHT(YEAR(F12),2)&IF(LEN(MONTH(F12))=1,\"0\"&MONTH(F12),MONTH(F12))&     IF(LEN(DAY(F12))=1,\"0\"&DAY(F12),DAY(F12))      &LEFT(H12,1)&LEFT(\"00\"&INT(G12),5)&IF(G12-INT(G12)=0,\"000\",LEFT(RIGHT(G12-INT(G12)&\"00\",6)*1000000,3))","v":"@AAPL  200124C00280000"},{"$f":"IFERROR(VLOOKUP($J12,Table1[[#All],[symbolstring]:[vega]],MATCH(K$9,Table1[#Headers],0)-1,0),\"\")","v":20.3},{"$f":"IFERROR(VLOOKUP($J12,Table1[[#All],[symbolstring]:[vega]],MATCH(L$9,Table1[#Headers],0)-1,0),\"\")","v":20.55},{"$f":"IFERROR(VLOOKUP($J12,Table1[[#All],[symbolstring]:[vega]],MATCH(M$9,Table1[#Headers],0)-1,0),\"\")","v":20.350000000000001},10.5,0.19999999999999929,{"$f":"IFERROR(VLOOKUP($J12,Table1[[#All],[symbolstring]:[vega]],MATCH(O$9,Table1[#Headers],0)-1,0),\"\")","v":81},100,{"$f":"IF(I12<>\"\",Q12*T12*S12,0)","v":1050},{"$f":"IF(I12=Lists!$N$2,1,IF(I12=Lists!$N$3,-1,0))","v":1},{"$f":"IF(N12=\"\",IF(I12=Lists!$N$2,M12,IF(I12=Lists!$N$3,L12,K12)),N12)","v":10.5},{"$f":"R12","v":1050},{"$f":"IF(I12<>\"\",IF(H12=Lists!$C$1,MAX(0,ExpiryPrice-G12),IF(H12=Lists!$C$2,MAX(0,G12-ExpiryPrice),ExpiryPrice)),0)*Q12*S12","v":2000},{"$f":"V12-U12","v":950},null,null,null,null,null,null,{"$f":"setChartAxis(\"Option Profit Calculator\",\"Chart 9\",\"Max\",\"Value\",\"Y\",MAX($AM$26:$AM$5000))","v":"Value Y Max: 327.5"}]
[null,"Strategy","Long Call",null,2,"2020-01-31",277.5,"Call","Sell","@AAPL  200131C00277500",{"$f":"IFERROR(VLOOKUP($J13,Table1[[#All],[symbolstring]:[vega]],MATCH(K$9,Table1[#Headers],0)-1,0),\"\")","v":23.95},{"$f":"IFERROR(VLOOKUP($J13,Table1[[#All],[symbolstring]:[vega]],MATCH(L$9,Table1[#Headers],0)-1,0),\"\")","v":24.7},{"$f":"IFERROR(VLOOKUP($J13,Table1[[#All],[symbolstring]:[vega]],MATCH(M$9,Table1[#Headers],0)-1,0),\"\")","v":24.45},null,0.25,{"$f":"IFERROR(VLOOKUP($J13,Table1[[#All],[symbolstring]:[vega]],MATCH(O$9,Table1[#Headers],0)-1,0),\"\")","v":22},10,-247,{"$f":"IF(I13=Lists!$N$2,1,IF(I13=Lists!$N$3,-1,0))","v":-1},{"$f":"IF(N13=\"\",IF(I13=Lists!$N$2,M13,IF(I13=Lists!$N$3,L13,K13)),N13)","v":24.7},-247,{"$f":"IF(I13<>\"\",IF(H13=Lists!$C$1,MAX(0,ExpiryPrice-G13),IF(H13=Lists!$C$2,MAX(0,G13-ExpiryPrice),ExpiryPrice)),0)*Q13*S13","v":-225},22,null,null,null,null,null,null,{"$f":"setChartRange(\"Option Profit Calculator\",\"Chart 9\")","v":"Done"}]
[null,"Strikes",5,null,3,"2020-01-31",282.5,"Put","Sell","@AAPL  200131P00282500",{"$f":"IFERROR(VLOOKUP($J14,Table1[[#All],[symbolstring]:[vega]],MATCH(K$9,Table1[#Headers],0)-1,0),\"\")","v":3.7},{"$f":"IFERROR(VLOOKUP($J14,Table1[[#All],[symbolstring]:[vega]],MATCH(L$9,Table1[#Headers],0)-1,0),\"\")","v":3.75},{"$f":"IFERROR(VLOOKUP($J14,Table1[[#All],[symbolstring]:[vega]],MATCH(M$9,Table1[#Headers],0)-1,0),\"\")","v":3.65},null,0.10000000000000009,{"$f":"IFERROR(VLOOKUP($J14,Table1[[#All],[symbolstring]:[vega]],MATCH(O$9,Table1[#Headers],0)-1,0),\"\")","v":108},10,-37.5,{"$f":"IF(I14=Lists!$N$2,1,IF(I14=Lists!$N$3,-1,0))","v":-1},{"$f":"IF(N14=\"\",IF(I14=Lists!$N$2,M14,IF(I14=Lists!$N$3,L14,K14)),N14)","v":3.75},-37.5,{"$f":"IF(I14<>\"\",IF(H14=Lists!$C$1,MAX(0,ExpiryPrice-G14),IF(H14=Lists!$C$2,MAX(0,G14-ExpiryPrice),ExpiryPrice)),0)*Q14*S14","v":0},37.5]
[null,"Legs",1,null,4,null,null,null,null,"@AAPL  000100000000",{"$f":"IFERROR(VLOOKUP($J15,Table1[[#All],[symbolstring]:[vega]],MATCH(K$9,Table1[#Headers],0)-1,0),\"\")","v":""},{"$f":"IFERROR(VLOOKUP($J15,Table1[[#All],[symbolstring]:[vega]],MATCH(L$9,Table1[#Headers],0)-1,0),\"\")","v":""},{"$f":"IFERROR(VLOOKUP($J15,Table1[[#All],[symbolstring]:[vega]],MATCH(M$9,Table1[#Headers],0)-1,0),\"\")","v":""},null,"",{"$f":"IFERROR(VLOOKUP($J15,Table1[[#All],[symbolstring]:[vega]],MATCH(O$9,Table1[#Headers],0)-1,0),\"\")","v":""},null,0,{"$f":"IF(I15=Lists!$N$2,1,IF(I15=Lists!$N$3,-1,0))","v":0},{"$f":"IF(N15=\"\",IF(I15=Lists!$N$2,M15,IF(I15=Lists!$N$3,L15,K15)),N15)","v":""},0,{"$f":"IF(I15<>\"\",IF(H15=Lists!$C$1,MAX(0,ExpiryPrice-G15),IF(H15=Lists!$C$2,MAX(0,G15-ExpiryPrice),ExpiryPrice)),0)*Q15*S15","v":0},0]
[null,null,null,null,5,null,null,null,null,"@AAPL  000100000000",{"$f":"IFERROR(VLOOKUP($J16,Table1[[#All],[symbolstring]:[vega]],MATCH(K$9,Table1[#Headers],0)-1,0),\"\")","v":""},{"$f":"IFERROR(VLOOKUP($J16,Table1[[#All],[symbolstring]:[vega]],MATCH(L$9,Table1[#Headers],0)-1,0),\"\")","v":""},{"$f":"IFERROR(VLOOKUP($J16,Table1[[#All],[symbolstring]:[vega]],MATCH(M$9,Table1[#Headers],0)-1,0),\"\")","v":""},null,"",{"$f":"IFERROR(VLOOKUP($J16,Table1[[#All],[symbolstring]:[vega]],MATCH(O$9,Table1[#Headers],0)-1,0),\"\")","v":""},null,0,{"$f":"IF(I16=Lists!$N$2,1,IF(I16=Lists!$N$3,-1,0))","v":0},{"$f":"IF(N16=\"\",IF(I16=Lists!$N$2,M16,IF(I16=Lists!$N$3,L16,K16)),N16)","v":""},0,{"$f":"IF(I16<>\"\",IF(H16=Lists!$C$1,MAX(0,ExpiryPrice-G16),IF(H16=Lists!$C$2,MAX(0,G16-ExpiryPrice),ExpiryPrice)),0)*Q16*S16","v":0},0]
[null,null,null,null,6,null,null,null,null,"@AAPL  000100000000",{"$f":"IFERROR(VLOOKUP($J17,Table1[[#All],[symbolstring]:[vega]],MATCH(K$9,Table1[#Headers],0)-1,0),\"\")","v":""},{"$f":"IFERROR(VLOOKUP($J17,Table1[[#All],[symbolstring]:[vega]],MATCH(L$9,Table1[#Headers],0)-1,0),\"\")","v":""},{"$f":"IFERROR(VLOOKUP($J17,Table1[[#All],[symbolstring]:[vega]],MATCH(M$9,Table1[#Headers],0)-1,0),\"\")","v":""},null,"",{"$f":"IFERROR(VLOOKUP($J17,Table1[[#All],[symbolstring]:[vega]],MATCH(O$9,Table1[#Headers],0)-1,0),\"\")","v":""},null,0,{"$f":"IF(I17=Lists!$N$2,1,IF(I17=Lists!$N$3,-1,0))","v":0},{"$f":"IF(N17=\"\",IF(I17=Lists!$N$2,M17,IF(I17=Lists!$N$3,L17,K17)),N17)","v":""},0,{"$f":"IF(I17<>\"\",IF(H17=Lists!$C$1,MAX(0,ExpiryPrice-G17),IF(H17=Lists!$C$2,MAX(0,G17-ExpiryPrice),ExpiryPrice)),0)*Q17*S17","v":0},0]
[null,null,null,null,null,null,null,null,null,null,null,null,null,null,null,null,"Net Investment:",{"$f":"SUM(R11:R17)","v":1076.3899999999999},null,null,{"$f":"SUM(U11:U17)","v":1076.3899999999999},{"$f":"SUM(V11:V17)","v":2075},{"$f":"SUM(W11:W17)","v":998.61}]
[null,"Custom Strategies",null,null,null,null,null,null,null,"Scenario Calculation"]
[null,"Type","Strikes",null,null,null,null,null,null,"Price (At Expiry)",300]
[null,"Bearish",11,null,null,null,null,null,null,"Profit/Loss",{"$f":"W18","v":998.61}]
[null,"Strategy"]
[null,"Short + Caller",null,null,null,null,null,null,null,null,null,null,null,null,null,null,null,null,null,null,null,null,null,null,null,null,null,null,null,null,null,null,null,null,null,null,null,null,"Stock Price At Expiry","Position Profit"]
[null,null,null,null," ","symbolstring","datetime","last","change","changepercent","tick","open","high","low","prevclose","bid","ask","bidsize","asksize","contractvolume","lasttradedatetime","callput","expirydate","strike","openinterest","contracthigh","contractlow","type","delta","gamma","theta","rho","vega","impvol","Column30","Column31","Column32",null,null,{"$f":"K21","v":998.61}]
[{"$f":"N25","v":0.05},null,null,null,null,"@AAPL  200110P00270000","2020-01-06T13:47:59-05:00",7.0000000000000007E-2,-0.11,-61.1111,-1,0.24,0.24,0.05,0.18,0.05,7.0000000000000007E-2,43,205,746,"2020-01-06T13:24:28","Put","2020-01-10",270,4098,15.0100002,0.109999999,"WEEK",-1.8180000000000002E-2,2.8600000000000001E-3,-9.8390000000000005E-2,-5.5000000000000003E-4,3.1669999999999997E-2,0.36892000000000003,null,null,null,null,0,-3901.39]
[{"$f":"N26","v":24.35},null,null,null,null,"@AAPL  200110C00270000","2020-01-06T13:47:59-05:00",29.04,0.59,2.0737999999999999,0,24.35,29.1,24.35,28.45,29.15,29.3,20,175,86,"2020-01-06T13:45:59","Call","2020-01-10",270,994,30.649999600000001,2.8499998999999998,"WEEK",0.99990000000000001,0,-0.11157,3.022E-2,0,5.176E-2,null,null,null,null,{"$f":"IF(Lists!Q4=0,\"\",Lists!Q4)","v":270},-931.38999999999987]
[7.0000000000000007E-2,null,null,null,null,"@AAPL  200110P00272500","2020-01-06T13:47:59-05:00",0.08,-0.13,-61.904800000000002,0,0.25,0.25,7.0000000000000007E-2,0.21,7.0000000000000007E-2,0.08,8,172,1949,"2020-01-06T13:45:26","Put","2020-01-10",272.5,4247,17.1200008,0.14000000000000001,"WEEK",-1.311E-2,2.5300000000000001E-3,-6.0290000000000003E-2,-4.4000000000000002E-4,7.8300000000000002E-3,0.36897000000000002,null,null,null,null,{"$f":"IF(Lists!Q5=0,\"\",Lists!Q5)","v":272.5},-903.88999999999987]
[24.05,null,null,null,null,"@AAPL  200110C00272500","2020-01-06T13:47:59-05:00",25.68,-1.4,-5.1699000000000002,1,24.05,25.68,24.05,27.08,26.65,26.8,22,167,45,"2020-01-06T10:52:00","Call","2020-01-10",272.5,1058,27.850000300000001,2.33999991,"WEEK",0.99990000000000001,0,-0.11269,3.049E-2,0,2.0219999999999998E-2,null,null,null,null,{"$f":"IF(Lists!Q6=0,\"\",Lists!Q6)","v":275},-876.38999999999987]
[0.01,null,null,null,null,"@AAPL  200110P00275000","2020-01-06T13:47:59-05:00",0.09,-0.18,-66.666700000000006,1,0.31,0.39,0.01,0.27,0.08,0.09,69,62,2604,"2020-01-06T13:45:56","Put","2020-01-10",275,5128,19.1200008,0.17000000100000001,"WEEK",-1.473E-2,3.0500000000000002E-3,-6.2799999999999995E-2,-4.8999999999999998E-4,7.8399999999999997E-3,0.36270999999999998,null,null,null,null,{"$f":"IF(Lists!Q7=0,\"\",Lists!Q7)","v":277.5},-848.88999999999987]
[18.5,null,null,null,null,"@AAPL  200110C00275000","2020-01-06T13:47:59-05:00",24.06,0.87,3.7515999999999998,0,18.5,24.59,18.5,23.19,24.15,24.3,52,154,51,"2020-01-06T13:45:59","Call","2020-01-10",275,1463,25.6800003,1.7599999900000001,"WEEK",0.99990000000000001,0,-0.11380999999999999,3.0769999999999999E-2,0,5.176E-2,null,null,null,null,{"$f":"IF(Lists!Q8=0,\"\",Lists!Q8)","v":280},-846.38999999999987]
[0.12,null,null,null,null,"@AAPL  200110P00277500","2020-01-06T13:47:59-05:00",0.12,-0.19,-61.290300000000002,0,0.49,0.51,0.12,0.31,0.11,0.12,4,221,1172,"2020-01-06T13:31:08","Put","2020-01-10",277.5,1428,16.629999099999999,0.219999998,"WEEK",-1.917E-2,4.0400000000000002E-3,-7.4560000000000001E-2,-5.8E-4,3.1519999999999999E-2,0.35566999999999999,null,null,null,null,{"$f":"IF(Lists!Q9=0,\"\",Lists!Q9)","v":282.5},-593.89]
[15.3,null,null,null,null,"@AAPL  200110C00277500","2020-01-06T13:47:59-05:00",20.95,-0.11,-0.52231700000000003,0,16.5,20.95,15.3,21.06,21.7,21.85,15,183,40,"2020-01-06T13:06:30","Call","2020-01-10",277.5,485,23.100000300000001,1.4400000500000001,"WEEK",0.99990000000000001,0,-0.11493,3.1050000000000001E-2,0,3.2349999999999997E-2,null,null,null,null,{"$f":"IF(Lists!Q10=0,\"\",Lists!Q10)","v":285},-366.39]
[0.14000000000000001,null,null,null,null,"@AAPL  200110P00280000","2020-01-06T13:47:59-05:00",0.14000000000000001,-0.26,-65,0,0.49,0.74,0.14000000000000001,0.4,0.14000000000000001,0.15,119,88,6895,"2020-01-06T13:47:50","Put","2020-01-10",280,12186,16.1800003,0.28999999100000001,"WEEK",-3.6679999999999997E-2,6.9199999999999999E-3,-0.11942,-1.1800000000000001E-3,3.1809999999999998E-2,0.33339999999999997,null,null,null,null,{"$f":"IF(Lists!Q11=0,\"\",Lists!Q11)","v":287.5},-138.88999999999999]
[13.91,null,null,null,null,"@AAPL  200110C00280000","2020-01-06T13:47:59-05:00",19.079999999999998,0.78,4.2622999999999998,1,15.3,19.8,13.91,18.3,19.25,19.350000000000001,10,117,540,"2020-01-06T13:28:15","Call","2020-01-10",280,2479,21.040000899999999,1.1499999700000001,"WEEK",0.99990000000000001,0,-0.11605,3.1329999999999997E-2,0,1.264E-2,null,null,null,null,{"$f":"IF(Lists!Q12=0,\"\",Lists!Q12)","v":290},88.610000000000014]
[0.19,null,null,null,null,"@AAPL  200110P00282500","2020-01-06T13:47:59-05:00",0.19,-0.33,-63.461500000000001,0,0.85,1.05,0.19,0.52,0.19,0.2,134,160,2296,"2020-01-06T13:47:50","Put","2020-01-10",282.5,8065,10.8500003,0.37999999499999998,"WEEK",-4.1520000000000001E-2,8.6300000000000005E-3,-0.11749999999999999,-1.34E-3,3.177E-2,0.32444000000000001,null,null,null,null,{"$f":"IF(Lists!Q13=0,\"\",Lists!Q13)","v":292.5},316.11]
[11.8,null,null,null,null,"@AAPL  200110C00282500","2020-01-06T13:47:59-05:00",16.55,0.4,2.4767999999999999,1,11.8,17.25,11.8,16.149999999999999,16.8,16.899999999999999,10,109,227,"2020-01-06T13:36:04","Call","2020-01-10",282.5,1950,18.6200008,1.0800000400000001,"WEEK",0.99990000000000001,0,-0.11717,3.1609999999999999E-2,0,0.3528,null,null,null,null,{"$f":"IF(Lists!Q14=0,\"\",Lists!Q14)","v":295},543.61]
[0.28999999999999998,null,null,null,null,"@AAPL  200110P00285000","2020-01-06T13:47:59-05:00",0.28999999999999998,-0.46,-61.333300000000001,0,1,1.42,0.28999999999999998,0.75,0.28000000000000003,0.28999999999999998,120,56,3850,"2020-01-06T13:47:48","Put","2020-01-10",285,7118,18.989999699999998,0.51999998000000003,"WEEK",-7.1940000000000004E-2,1.3559999999999999E-2,-0.19672000000000001,-2.3700000000000001E-3,3.2480000000000002E-2,0.29004000000000002,null,null,null,null,{"$f":"IF(Lists!Q15=0,\"\",Lists!Q15)","v":297.5},771.11]
[9.33,null,null,null,null,"@AAPL  200110C00285000","2020-01-06T13:47:59-05:00",14.22,0.67,4.9446000000000003,0,9.33,15.1,9.33,13.55,14.35,14.5,95,153,2444,"2020-01-06T13:28:02","Call","2020-01-10",285,2713,16.299999199999998,0.63999998499999999,"WEEK",0.99990000000000001,0,-0.11829000000000001,3.1890000000000002E-2,0,0.11387,null,null,null,null,{"$f":"IF(Lists!Q16=0,\"\",Lists!Q16)","v":300},998.61]
[0.44,null,null,null,null,"@AAPL  200110P00287500","2020-01-06T13:47:59-05:00",0.44,-0.59,-57.281599999999997,-1,1.9,2,0.44,1.03,0.43,0.44,136,12,3837,"2020-01-06T13:47:57","Put","2020-01-10",287.5,3489,23.600000300000001,0.730000019,"WEEK",-7.8159999999999993E-2,1.7059999999999999E-2,-0.18151,-2.4199999999999998E-3,5.6599999999999998E-2,0.24961,null,null,null,null,{"$f":"IF(Lists!Q17=0,\"\",Lists!Q17)","v":302.5},1226.1100000000001]
[8.42,null,null,null,null,"@AAPL  200110C00287500","2020-01-06T13:47:59-05:00",12.15,0.75,6.5789,1,8.42,12.75,8.42,11.4,12,12.15,233,135,569,"2020-01-06T13:47:49","Call","2020-01-10",287.5,1909,14.0500001,0.810000002,"WEEK",0.92490000000000006,1.6930000000000001E-2,-0.28793999999999997,2.964E-2,3.2210000000000003E-2,0.25803999999999999,null,null,null,null,{"$f":"IF(Lists!Q18=0,\"\",Lists!Q18)","v":305},1453.6100000000001]
{"$rows_left_out":385}
{"sheet":"Notes","index":1,"n_rows":0,"n_cols":0,"rows_kept":0,"cut":false,"hidden":false,"merged":[]}

{"sheet":"Lists","index":2,"n_rows":55,"n_cols":20,"rows_kept":55,"cut":false,"hidden":false,"merged":[]}
["Stratregy","Category","Call",null,"Bullish","Bearish","Volatality",null,null,"Enter At",null,"Strikes"]
["Long Stock","The Basics","Put",null,"Long Call","Long Put","Long Straddle",null,null,"Bid",null,1,null,"Buy",null,null,null,null,"Direction"]
["Short Stock","The Basics",null,null,"Short Put","Short Call","Long Stragle",null,null,"Ask",null,{"$f":"+L2+1","v":2},null,"Sell",null,"expirydate","strike","Profit","Call","Buy"]
["Long Call","The Basics",null,null,"Short + Covered Call","Long Put Spread","Long Iron Condor",null,null,"Mid",null,{"$f":"+L3+1","v":3},null,null,null,"2020-01-10",270,{"$f":"VLOOKUP(Q4,'Option Profit Calculator'!#REF!,10,)","v":{"$error":"#REF!"}},"Put","Sell"]
["Short Call","The Basics",null,null,"Short + Married Put","Long Put Backspread","Long Call Butterfly",null,null,"Limit",null,4,null,null,null,"2020-01-17",272.5,{"$f":"VLOOKUP(Q5,'Option Profit Calculator'!#REF!,10,)","v":{"$error":"#REF!"}}]
["Long Put","The Basics",null,null,"Short + Caller","Short Call Spread","Long Put Butterfy",null,null,null,null,5,null,null,null,"2020-01-24",275,{"$f":"VLOOKUP(Q6,'Option Profit Calculator'!#REF!,10,)","v":{"$error":"#REF!"}},"CallBuy","Long"]
["Short Put","The Basics",null,null,"Long Call Spread","Short Call BackSpread","Short Straddle",null,null,null,null,6,null,null,null,"2020-01-31",277.5,{"$f":"VLOOKUP(Q7,'Option Profit Calculator'!#REF!,10,)","v":{"$error":"#REF!"}},"CallSell","Short"]
["Covered Call","The Basics",null,null,"Long Call BackSpread",null,"Short Strangle",null,null,null,null,7,null,null,null,"2020-02-07",280,{"$f":"VLOOKUP(Q8,'Option Profit Calculator'!#REF!,10,)","v":{"$error":"#REF!"}},"PutBuy","Short"]
["Protective Put","The Basics",null,null,"Short Put Spread",null,"Short Iron Condor",null,null,null,null,8,null,null,null,"2020-02-14",282.5,{"$f":"VLOOKUP(Q9,'Option Profit Calculator'!#REF!,10,)","v":{"$error":"#REF!"}},"PutSell","Long"]
["Long Straddle","Straddles, Strangles, Guts",null,null,"Short Put BackSpread",null,"Short Call Butterfly",null,null,null,null,9,null,null,null,"2020-02-21",285,{"$f":"VLOOKUP(Q10,'Option Profit Calculator'!#REF!,10,)","v":{"$error":"#REF!"}}]
["Long Strangle","Straddles, Strangles, Guts",null,null,null,null,"Short Put Butterfly",null,null,null,null,10,null,null,null,"2020-03-20",287.5,{"$f":"VLOOKUP(Q11,'Option Profit Calculator'!#REF!,10,)","v":{"$error":"#REF!"}}]
["Long Guts","Straddles, Strangles, Guts",null,null,null,null,null,null,null,null,null,11,null,null,null,"2020-04-17",290,{"$f":"VLOOKUP(Q12,'Option Profit Calculator'!#REF!,10,)","v":{"$error":"#REF!"}}]
["Short Straddle","Straddles, Strangles, Guts",null,null,null,null,null,null,null,null,null,12,null,null,null,"2020-06-19",292.5,{"$f":"VLOOKUP(Q13,'Option Profit Calculator'!#REF!,10,)","v":{"$error":"#REF!"}}]
["Short Strangle","Straddles, Strangles, Guts",null,null,null,null,null,null,null,null,null,13,null,null,null,"2020-07-17",295,{"$f":"VLOOKUP(Q14,'Option Profit Calculator'!#REF!,10,)","v":{"$error":"#REF!"}}]
["Short Guts","Straddles, Strangles, Guts",null,null,null,null,null,null,null,null,null,14,null,null,null,"2020-09-18",297.5,{"$f":"VLOOKUP(Q15,'Option Profit Calculator'!#REF!,10,)","v":{"$error":"#REF!"}}]
["Long Call Butterfly","Long Call Butterfly",null,null,null,null,null,null,null,null,null,15,null,null,null,"2021-01-15",300,{"$f":"VLOOKUP(Q16,'Option Profit Calculator'!#REF!,10,)","v":{"$error":"#REF!"}}]
["Long Put Butterfly","Long Put Butterfly",null,null,null,null,null,null,null,null,null,16,null,null,null,"2021-06-18",302.5,{"$f":"VLOOKUP(Q17,'Option Profit Calculator'!#REF!,10,)","v":{"$error":"#REF!"}}]
["Long Iron Butterfly","Long Iron Butterfly",null,null,null,null,null,null,null,null,null,17,null,null,null,"2021-09-17",305,{"$f":"VLOOKUP(Q18,'Option Profit Calculator'!#REF!,10,)","v":{"$error":"#REF!"}}]
["Long Call Condor","Long Call Condor",null,null,null,null,null,null,null,null,null,18,null,null,null,"2022-01-21",307.5,{"$f":"VLOOKUP(Q19,'Option Profit Calculator'!#REF!,10,)","v":{"$error":"#REF!"}}]
["Long Put Condor","Long Put Condor",null,null,null,null,null,null,null,null,null,19,null,null,null,null,310,{"$f":"VLOOKUP(Q20,'Option Profit Calculator'!#REF!,10,)","v":{"$error":"#REF!"}}]
["Long Iron Condor","Long Iron Condor",null,null,null,null,null,null,null,null,null,20,null,null,null,null,312.5,{"$f":"VLOOKUP(Q21,'Option Profit Calculator'!#REF!,10,)","v":{"$error":"#REF!"}}]
["Short Call Butterfly","Short Call Butterfly",null,null,null,null,null,null,null,null,null,21,null,null,null,null,315,{"$f":"VLOOKUP(Q22,'Option Profit Calculator'!#REF!,10,)","v":{"$error":"#REF!"}}]
["Short Put Butterfly","Short Put Butterfly",null,null,null,null,null,null,null,null,null,22,null,null,null,null,317.5,{"$f":"VLOOKUP(Q23,'Option Profit Calculator'!#REF!,10,)","v":{"$error":"#REF!"}}]
["Short Iron Butterfly","Short Iron Butterfly",null,null,null,null,null,null,null,null,null,23,null,null,null,null,320,{"$f":"VLOOKUP(Q24,'Option Profit Calculator'!#REF!,10,)","v":{"$error":"#REF!"}}]
["Short Call Condor","Short Call Condor",null,null,null,null,null,null,null,null,null,24,null,null,null,null,322.5,{"$f":"VLOOKUP(Q25,'Option Profit Calculator'!#REF!,10,)","v":{"$error":"#REF!"}}]
["Short Put Condor","Short Put Condor",null,null,null,null,null,null,null,null,null,25,null,null,null,null,325,{"$f":"VLOOKUP(Q26,'Option Profit Calculator'!#REF!,10,)","v":{"$error":"#REF!"}}]
["Short Iron Condor","Short Iron Condor",null,null,null,null,null,null,null,null,null,26,null,null,null,null,327.5,{"$f":"VLOOKUP(Q27,'Option Profit Calculator'!#REF!,10,)","v":{"$error":"#REF!"}}]
["Bull Call Spread","Vertical Spreads, Ladders, Ratio Spreads",null,null,null,null,null,null,null,null,null,27,null,null,null,null,null,{"$f":"VLOOKUP(Q28,'Option Profit Calculator'!#REF!,10,)","v":{"$error":"#REF!"}}]
["Bear Put Spread","Vertical Spreads, Ladders, Ratio Spreads",null,null,null,null,null,null,null,null,null,28,null,null,null,null,null,{"$f":"VLOOKUP(Q29,'Option Profit Calculator'!#REF!,10,)","v":{"$error":"#REF!"}}]
["Bear Call Spread","Vertical Spreads, Ladders, Ratio Spreads",null,null,null,null,null,null,null,null,null,29,null,null,null,null,null,{"$f":"VLOOKUP(Q30,'Option Profit Calculator'!#REF!,10,)","v":{"$error":"#REF!"}}]
["Bull Put Spread","Vertical Spreads, Ladders, Ratio Spreads",null,null,null,null,null,null,null,null,null,30,null,null,null,null,null,{"$f":"VLOOKUP(Q31,'Option Profit Calculator'!#REF!,10,)","v":{"$error":"#REF!"}}]
["Bull Call Ladder","Vertical Spreads, Ladders, Ratio Spreads",null,null,null,null,null,null,null,null,null,31,null,null,null,null,null,{"$f":"VLOOKUP(Q32,'Option Profit Calculator'!#REF!,10,)","v":{"$error":"#REF!"}}]
["Bull Put Ladder","Vertical Spreads, Ladders, Ratio Spreads",null,null,null,null,null,null,null,null,null,32,null,null,null,null,null,{"$f":"VLOOKUP(Q33,'Option Profit Calculator'!#REF!,10,)","v":{"$error":"#REF!"}}]
["Bear Call Ladder","Vertical Spreads, Ladders, Ratio Spreads",null,null,null,null,null,null,null,null,null,33,null,null,null,null,null,{"$f":"VLOOKUP(Q34,'Option Profit Calculator'!#REF!,10,)","v":{"$error":"#REF!"}}]
["Bear Put Ladder","Vertical Spreads, Ladders, Ratio Spreads",null,null,null,null,null,null,null,null,null,34,null,null,null,null,null,{"$f":"VLOOKUP(Q35,'Option Profit Calculator'!#REF!,10,)","v":{"$error":"#REF!"}}]
["Strip","Vertical Spreads, Ladders, Ratio Spreads",null,null,null,null,null,null,null,null,null,35,null,null,null,null,null,{"$f":"VLOOKUP(Q36,'Option Profit Calculator'!#REF!,10,)","v":{"$error":"#REF!"}}]
["Strap","Vertical Spreads, Ladders, Ratio Spreads",null,null,null,null,null,null,null,null,null,36,null,null,null,null,null,{"$f":"VLOOKUP(Q37,'Option Profit Calculator'!#REF!,10,)","v":{"$error":"#REF!"}}]
["Covered Short Straddle","Vertical Spreads, Ladders, Ratio Spreads",null,null,null,null,null,null,null,null,null,37,null,null,null,null,null,{"$f":"VLOOKUP(Q38,'Option Profit Calculator'!#REF!,10,)","v":{"$error":"#REF!"}}]
["Covered Short Strangle","Vertical Spreads, Ladders, Ratio Spreads",null,null,null,null,null,null,null,null,null,38,null,null,null,null,null,{"$f":"VLOOKUP(Q39,'Option Profit Calculator'!#REF!,10,)","v":{"$error":"#REF!"}}]
["Ratio Call Backspread","Vertical Spreads, Ladders, Ratio Spreads",null,null,null,null,null,null,null,null,null,39,null,null,null,null,null,{"$f":"VLOOKUP(Q40,'Option Profit Calculator'!#REF!,10,)","v":{"$error":"#REF!"}}]
{"$rows_left_out":15}